Target
Beta-1 adrenergic receptor
Ligand
BDBM50002146
Substrate
Meas. Tech.
ChEBML_39323
Ki
150±n/a nM
Citation
 Meurer, LCTolman, RLChapin, EWSaperstein, RVicario, PPZrada, MMMacCoss, M Synthesis and hypoglycemic activity of substituted 8-(1-piperazinyl)imidazo[1,2-a]pyrazines. J Med Chem 35:3845-57 (1992)  
Target
Name:
Beta-1 adrenergic receptor
Synonyms:
ADRB1 adrenergic Beta1
Type:
Enzyme Catalytic Domain
Mol. Mass.:
50540.48
Organism:
GUINEA PIG
Description:
adrenergic Beta1 ADRB1 GUINEA PIG::B0FL73
Residue:
467
  
Inhibitor
Name:
BDBM50002146
Synonyms:
3,6-Dimethyl-8-piperazin-1-yl-imidazo[1,2-a]pyrazine; 2M.hydrochloride | CHEMBL554785
Type:
Small organic molecule
Emp. Form.:
C12H17N5
Mol. Mass.:
231.2969
SMILES:
Cc1cnc2c(nc(C)cn12)N1CCNCC1
: