Target
Neutrophil elastase
Ligand
BDBM50035492
Substrate
Meas. Tech.
ChEMBL_63990 (CHEMBL673100)
Ki
19±n/a nM
Citation
 Angelastro, MRBaugh, LEBey, PBurkhart, JPChen, TMDurham, SLHare, CMHuber, EWJanusz, MJKoehl, JR Inhibition of human neutrophil elastase with peptidyl electrophilic ketones. 2. Orally active PG-Val-Pro-Val pentafluoroethyl ketones. J Med Chem 37:4538-53 (1995)  
Target
Name:
Neutrophil elastase
Synonyms:
Bone marrow serine protease Coagulation factor X ELANE Elastase HLE Leukocyte elastase Medullasin Neutrophil elastase (HNE) PMN elastase Trypsin
Type:
Enzyme
Mol. Mass.:
28532.38
Organism:
Homo sapiens (Human)
Description:
P08246
Residue:
267
  
Inhibitor
Name:
BDBM50035492
Synonyms:
(S)-1-{(S)-3-Methyl-2-[4-(2-methyl-4-morpholin-4-yl-butyryl)-benzoylamino]-butyryl}-pyrrolidine-2-carboxylic acid (3,3,4,4,4-pentafluoro-1-isopropyl-2-oxo-butyl)-amide | CHEMBL344451
Type:
Small organic molecule
Emp. Form.:
C33H45F5N4O6
Mol. Mass.:
688.7256
SMILES:
CC(C)[C@H](NC(=O)c1ccc(cc1)C(=O)C(C)CCN1CCOCC1)C(=O)N1CCC[C@H]1C(=O)NC(C(C)C)C(=O)C(F)(F)C(F)(F)F
: