Target
Neutrophil elastase
Ligand
BDBM50035497
Substrate
Meas. Tech.
ChEMBL_63994 (CHEMBL872887)
Ki
43±n/a nM
Citation
 Angelastro, MRBaugh, LEBey, PBurkhart, JPChen, TMDurham, SLHare, CMHuber, EWJanusz, MJKoehl, JR Inhibition of human neutrophil elastase with peptidyl electrophilic ketones. 2. Orally active PG-Val-Pro-Val pentafluoroethyl ketones. J Med Chem 37:4538-53 (1995)  
Target
Name:
Neutrophil elastase
Synonyms:
Bone marrow serine protease Coagulation factor X ELANE Elastase HLE Leukocyte elastase Medullasin Neutrophil elastase (HNE) PMN elastase Trypsin
Type:
Enzyme
Mol. Mass.:
28532.38
Organism:
Homo sapiens (Human)
Description:
P08246
Residue:
267
  
Inhibitor
Name:
BDBM50035497
Synonyms:
CHEMBL141423 | Morpholine-4-carboxylic acid (4-{(S)-2-methyl-1-[(S)-2-(3,3,4,4,4-pentafluoro-1-isopropyl-2-oxo-butylcarbamoyl)-pyrrolidine-1-carbonyl]-propylcarbamoyl}-phenyl)-amide
Type:
Small organic molecule
Emp. Form.:
C29H38F5N5O6
Mol. Mass.:
647.6339
SMILES:
CC(C)[C@H](NC(=O)c1ccc(NC(=O)N2CCOCC2)cc1)C(=O)N1CCC[C@H]1C(=O)NC(C(C)C)C(=O)C(F)(F)C(F)(F)F
: