Target
Progesterone receptor
Ligand
BDBM50048159
Substrate
Meas. Tech.
ChEMBL_159371 (CHEMBL768145)
IC50
270±n/a nM
Citation
 Combs, DWReese, KCornelius, LAGunnet, JWCryan, EVGranger, KSJordan, JJDemarest, KT Nonsteroidal progesterone receptor ligands. 2. High-affinity ligands with selectivity for bone cell progesterone receptors. J Med Chem 38:4880-4 (1996)  
Target
Name:
Progesterone receptor
Synonyms:
NR3C3 PGR PRGR_HUMAN | progesterone
Type:
Protein
Mol. Mass.:
98979.52
Organism:
Homo sapiens (Human)
Description:
P06401
Residue:
933
  
Inhibitor
Name:
BDBM50048159
Synonyms:
(4-Chloro-3-trifluoromethyl-phenyl)-(3-phenyl-5,6-dihydro-4H-pyridazin-1-yl)-methanone | CHEMBL144815
Type:
Small organic molecule
Emp. Form.:
C18H14ClF3N2O
Mol. Mass.:
366.765
SMILES:
FC(F)(F)c1cc(ccc1Cl)C(=O)N1CCCC(=N1)c1ccccc1
: