Target
Metabotropic glutamate receptor 7
Ligand
BDBM17660
Substrate
Meas. Tech.
ChEMBL_104478 (CHEMBL712460)
EC50
>1000000±n/a nM
Citation
 Knöpfel, TKuhn, RAllgeier, H Metabotropic glutamate receptors: novel targets for drug development. J Med Chem 38:1417-26 (1995)  
Target
Name:
Metabotropic glutamate receptor 7
Synonyms:
GPRC1G GRM7 protein MGLUR7 metabotropic glutamate 7
Type:
Enzyme Catalytic Domain
Mol. Mass.:
102262.98
Organism:
Homo sapiens (Human)
Description:
Q14831
Residue:
915
  
Inhibitor
Name:
BDBM17660
Synonyms:
(2S)-2-amino-3-(3,5-dioxo-1,2,4-oxadiazolidin-2-yl)propanoic acid CHEMBL279956 Quisqualate, L | quisqualic acid
Type:
Small organic molecule
Emp. Form.:
C5H7N3O5
Mol. Mass.:
189.1262
SMILES:
N[C@@H](Cn1oc(=O)[nH]c1=O)C(O)=O
: