Target
Angiotensin-converting enzyme
Ligand
BDBM50051780
Substrate
Meas. Tech.
ChEMBL_35223 (CHEMBL648945)
IC50
0.60±n/a nM
Citation
 Fournie-Zaluski, MCCoric, PThery, VGonzalez, WMeudal, HTurcaud, SMichel, JBRoques, BP Design of orally active dual inhibitors of neutral endopeptidase and angiotensin-converting enzyme with long duration of action. J Med Chem 39:2594-608 (1996)  
Target
Name:
Angiotensin-converting enzyme
Synonyms:
ACE_RAT Angiotensin-converting enzyme | Dcp1
Type:
PROTEIN
Mol. Mass.:
150907.81
Organism:
Rattus norvegicus
Description:
ChEMBL_35219
Residue:
1313
  
Inhibitor
Name:
BDBM50051780
Synonyms:
(2S,5R)-5-(2-Hydroxy-phenyl)-1-{2-[(S)-3-(4-hydroxy-phenyl)-2-mercapto-propionylamino]-acetyl}-pyrrolidine-2-carboxylic acid | CHEMBL313627
Type:
Small organic molecule
Emp. Form.:
C22H24N2O6S
Mol. Mass.:
444.501
SMILES:
OC(=O)[C@@H]1CC[C@@H](N1C(=O)CNC(=O)[C@@H](S)Cc1ccc(O)cc1)c1ccccc1O
: