Target
Angiotensin-converting enzyme
Ligand
BDBM50051784
Substrate
Meas. Tech.
ChEMBL_35223 (CHEMBL648945)
IC50
0.50±n/a nM
Citation
 Fournie-Zaluski, MCCoric, PThery, VGonzalez, WMeudal, HTurcaud, SMichel, JBRoques, BP Design of orally active dual inhibitors of neutral endopeptidase and angiotensin-converting enzyme with long duration of action. J Med Chem 39:2594-608 (1996)  
Target
Name:
Angiotensin-converting enzyme
Synonyms:
ACE_RAT Angiotensin-converting enzyme | Dcp1
Type:
PROTEIN
Mol. Mass.:
150907.81
Organism:
Rattus norvegicus
Description:
ChEMBL_35219
Residue:
1313
  
Inhibitor
Name:
BDBM50051784
Synonyms:
(2S,5R)-5-(2-Hydroxy-phenyl)-1-[2-((S)-2-mercapto-3-phenyl-propionylamino)-acetyl]-pyrrolidine-2-carboxylic acid | CHEMBL329125
Type:
Small organic molecule
Emp. Form.:
C22H24N2O5S
Mol. Mass.:
428.501
SMILES:
OC(=O)[C@@H]1CC[C@@H](N1C(=O)CNC(=O)[C@@H](S)Cc1ccccc1)c1ccccc1O
: