Target
Angiotensin-converting enzyme
Ligand
BDBM50051796
Substrate
Meas. Tech.
ChEMBL_35223 (CHEMBL648945)
IC50
0.42±n/a nM
Citation
 Fournie-Zaluski, MCCoric, PThery, VGonzalez, WMeudal, HTurcaud, SMichel, JBRoques, BP Design of orally active dual inhibitors of neutral endopeptidase and angiotensin-converting enzyme with long duration of action. J Med Chem 39:2594-608 (1996)  
Target
Name:
Angiotensin-converting enzyme
Synonyms:
ACE_RAT Angiotensin-converting enzyme | Dcp1
Type:
PROTEIN
Mol. Mass.:
150907.81
Organism:
Rattus norvegicus
Description:
ChEMBL_35219
Residue:
1313
  
Inhibitor
Name:
BDBM50051796
Synonyms:
(2S,5R)-5-(2-Hydroxy-phenyl)-1-{2-[(S)-2-mercapto-3-(4-methoxy-phenyl)-propionylamino]-acetyl}-pyrrolidine-2-carboxylic acid | CHEMBL88278
Type:
Small organic molecule
Emp. Form.:
C23H26N2O6S
Mol. Mass.:
458.527
SMILES:
COc1ccc(C[C@H](S)C(=O)NCC(=O)N2[C@@H](CC[C@@H]2c2ccccc2O)C(O)=O)cc1
: