Target
Neprilysin
Ligand
BDBM50051800
Substrate
Meas. Tech.
ChEMBL_144459 (CHEMBL755106)
IC50
1.5±n/a nM
Citation
 Fournie-Zaluski, MCCoric, PThery, VGonzalez, WMeudal, HTurcaud, SMichel, JBRoques, BP Design of orally active dual inhibitors of neutral endopeptidase and angiotensin-converting enzyme with long duration of action. J Med Chem 39:2594-608 (1996)  
Target
Name:
Neprilysin
Synonyms:
Atriopeptidase CD_antigen=CD10 MME NEP_RABIT Neutral endopeptidase 24.11
Type:
Enzyme
Mol. Mass.:
85570.75
Organism:
Oryctolagus cuniculus (rabbit)
Description:
NEP was purified to homogeneity from rabbit kidney.
Residue:
750
  
Inhibitor
Name:
BDBM50051800
Synonyms:
1-{2-[(S)-3-(4-Hydroxy-phenyl)-2-mercapto-propionylamino]-acetyl}-5-m-tolyl-pyrrolidine-2-carboxylic acid | CHEMBL315601
Type:
Small organic molecule
Emp. Form.:
C23H26N2O5S
Mol. Mass.:
442.528
SMILES:
Cc1cccc(c1)C1CCC(N1C(=O)CNC(=O)[C@@H](S)Cc1ccc(O)cc1)C(O)=O
: