Target
Nitric oxide synthase, brain
Ligand
BDBM50049252
Substrate
Meas. Tech.
ChEMBL_143361 (CHEMBL880846)
IC50
500±n/a nM
Citation
 Moore, WMWebber, RKFok, KFJerome, GMConnor, JRManning, PTWyatt, PSMisko, TPTjoeng, FSCurrie, MG 2-Iminopiperidine and other 2-iminoazaheterocycles as potent inhibitors of human nitric oxide synthase isoforms. J Med Chem 39:669-72 (1996)  
Target
Name:
Nitric oxide synthase, brain
Synonyms:
Constitutive NOS NC-NOS NOS type I nNOS NOS1_HUMAN Neuronal nitric oxide synthase Nitric oxide synthase, neuronal (nNOS) bNOS | nNOS
Type:
Homodimer
Mol. Mass.:
160985.98
Organism:
Homo sapiens (Human)
Description:
P29475
Residue:
1434
  
Inhibitor
Name:
BDBM50049252
Synonyms:
2-Amino-5-(N-nitro-guanidino)-pentanoic acid | CHEMBL353794
Type:
Small organic molecule
Emp. Form.:
C6H13N5O4
Mol. Mass.:
219.1985
SMILES:
N[C@@H](CCCN(C(N)=N)[N+]([O-])=O)C(O)=O
: