Target
Neprilysin
Ligand
BDBM50050149
Substrate
Meas. Tech.
ChEMBL_144463 (CHEMBL755110)
IC50
20±n/a nM
Citation
 Coric, PTurcaud, SMeudal, HRoques, BPFournie-Zaluski, MC Optimal recognition of neutral endopeptidase and angiotensin-converting enzyme active sites by mercaptoacyldipeptides as a means to design potent dual inhibitors. J Med Chem 39:1210-9 (1996)  
Target
Name:
Neprilysin
Synonyms:
Atriopeptidase CD_antigen=CD10 MME NEP_RABIT Neutral endopeptidase 24.11
Type:
Enzyme
Mol. Mass.:
85570.75
Organism:
Oryctolagus cuniculus (rabbit)
Description:
NEP was purified to homogeneity from rabbit kidney.
Residue:
750
  
Inhibitor
Name:
BDBM50050149
Synonyms:
1-[(S)-2-((S)-2-Mercapto-4-phenyl-butyrylamino)-propionyl]-pyrrolidine-2-carboxylic acid | CHEMBL410980
Type:
Small organic molecule
Emp. Form.:
C18H24N2O4S
Mol. Mass.:
364.459
SMILES:
C[C@H](NC(=O)[C@@H](S)CCc1ccccc1)C(=O)N1CCCC1C(O)=O
: