Target
Angiotensin-converting enzyme
Ligand
BDBM50050151
Substrate
Meas. Tech.
ChEMBL_35230 (CHEMBL647399)
IC50
0.30±n/a nM
Citation
 Coric, PTurcaud, SMeudal, HRoques, BPFournie-Zaluski, MC Optimal recognition of neutral endopeptidase and angiotensin-converting enzyme active sites by mercaptoacyldipeptides as a means to design potent dual inhibitors. J Med Chem 39:1210-9 (1996)  
Target
Name:
Angiotensin-converting enzyme
Synonyms:
ACE_RAT Angiotensin-converting enzyme | Dcp1
Type:
PROTEIN
Mol. Mass.:
150907.81
Organism:
Rattus norvegicus
Description:
ChEMBL_35219
Residue:
1313
  
Inhibitor
Name:
BDBM50050151
Synonyms:
1-[(S)-2-((S)-2-Mercapto-3-phenyl-propionylamino)-propionyl]-pyrrolidine-2-carboxylic acid | CHEMBL20326
Type:
Small organic molecule
Emp. Form.:
C17H22N2O4S
Mol. Mass.:
350.433
SMILES:
C[C@H](NC(=O)[C@@H](S)Cc1ccccc1)C(=O)N1CCCC1C(O)=O
: