Target
Angiotensin-converting enzyme
Ligand
BDBM50050140
Substrate
Meas. Tech.
ChEMBL_35230 (CHEMBL647399)
IC50
40±n/a nM
Citation
 Coric, PTurcaud, SMeudal, HRoques, BPFournie-Zaluski, MC Optimal recognition of neutral endopeptidase and angiotensin-converting enzyme active sites by mercaptoacyldipeptides as a means to design potent dual inhibitors. J Med Chem 39:1210-9 (1996)  
Target
Name:
Angiotensin-converting enzyme
Synonyms:
ACE_RAT Angiotensin-converting enzyme | Dcp1
Type:
PROTEIN
Mol. Mass.:
150907.81
Organism:
Rattus norvegicus
Description:
ChEMBL_35219
Residue:
1313
  
Inhibitor
Name:
BDBM50050140
Synonyms:
(S)-2-((S)-2-Mercapto-3-phenyl-propionylamino)-propionic acid | CHEMBL19846
Type:
Small organic molecule
Emp. Form.:
C12H15NO3S
Mol. Mass.:
253.317
SMILES:
C[C@H](NC(=O)[C@@H](S)Cc1ccccc1)C(O)=O
: