Target
Angiotensin-converting enzyme
Ligand
BDBM50050127
Substrate
Meas. Tech.
ChEMBL_35230 (CHEMBL647399)
IC50
0.26±n/a nM
Citation
 Coric, PTurcaud, SMeudal, HRoques, BPFournie-Zaluski, MC Optimal recognition of neutral endopeptidase and angiotensin-converting enzyme active sites by mercaptoacyldipeptides as a means to design potent dual inhibitors. J Med Chem 39:1210-9 (1996)  
Target
Name:
Angiotensin-converting enzyme
Synonyms:
ACE_RAT Angiotensin-converting enzyme | Dcp1
Type:
PROTEIN
Mol. Mass.:
150907.81
Organism:
Rattus norvegicus
Description:
ChEMBL_35219
Residue:
1313
  
Inhibitor
Name:
BDBM50050127
Synonyms:
(S)-3-(4-Hydroxy-phenyl)-2-[(2S,3R)-2-((S)-2-mercapto-3-methyl-butyrylamino)-3-methyl-pentanoylamino]-propionic acid | CHEMBL20341
Type:
Small organic molecule
Emp. Form.:
C20H30N2O5S
Mol. Mass.:
410.528
SMILES:
CC[C@@H](C)[C@H](NC(=O)[C@@H](S)C(C)C)C(=O)N[C@@H](Cc1ccc(O)cc1)C(O)=O
: