Target
5-hydroxytryptamine receptor 2C
Ligand
BDBM50056947
Substrate
Meas. Tech.
ChEMBL_1849 (CHEMBL616820)
Ki
1260±n/a nM
Citation
 el Ahmad, YLaurent, EMaillet, PTalab, ATeste, JFDokhan, RTran, GOllivier, R New benzocycloalkylpiperazines, potent and selective 5-HT1A receptor ligands. J Med Chem 40:952-60 (1997)  
Target
Name:
5-hydroxytryptamine receptor 2C
Synonyms:
5-HT-1C 5-HT1C 5-HT2C-INI 5-HTR2C 5-hydroxytryptamine receptor 2C (5-HT-2C) 5HT-1C HTR1C Serotonin (5-HT3) receptor Serotonin Receptor 2C
Type:
G Protein-Coupled Receptor (GPCR)
Mol. Mass.:
51836.79
Organism:
Homo sapiens (Human)
Description:
P28335
Residue:
458
  
Inhibitor
Name:
BDBM50056947
Synonyms:
CHEMBL354210 | N-{2-[4-(1,2,3,4-Tetrahydro-naphthalen-1-yl)-piperazin-1-yl]-ethyl}-benzamide
Type:
Small organic molecule
Emp. Form.:
C23H29N3O
Mol. Mass.:
363.4959
SMILES:
O=C(NCCN1CCN(CC1)C1CCCc2ccccc12)c1ccccc1
: