Target
5-hydroxytryptamine receptor 1A
Ligand
BDBM50056947
Substrate
Meas. Tech.
ChEMBL_571 (CHEMBL615589)
Ki
0.400±n/a nM
Citation
 el Ahmad, YLaurent, EMaillet, PTalab, ATeste, JFDokhan, RTran, GOllivier, R New benzocycloalkylpiperazines, potent and selective 5-HT1A receptor ligands. J Med Chem 40:952-60 (1997)  
Target
Name:
5-hydroxytryptamine receptor 1A
Synonyms:
5-HT-1A 5-HT1A 5-hydroxytryptamine receptor 1A (5HT1A) 5ht1a Htr1a Serotonin 1a (5-HT1a) receptor/Adrenergic receptor alpha-1 | Serotonin receptor 1A
Type:
G Protein-Coupled Receptor (GPCR)
Mol. Mass.:
46445.29
Organism:
Rattus norvegicus (rat)
Description:
Binding assays were performed using rat hippocampal membranes.
Residue:
422
  
Inhibitor
Name:
BDBM50056947
Synonyms:
CHEMBL354210 | N-{2-[4-(1,2,3,4-Tetrahydro-naphthalen-1-yl)-piperazin-1-yl]-ethyl}-benzamide
Type:
Small organic molecule
Emp. Form.:
C23H29N3O
Mol. Mass.:
363.4959
SMILES:
O=C(NCCN1CCN(CC1)C1CCCc2ccccc12)c1ccccc1
: