Target
Nitric oxide synthase, inducible
Ligand
BDBM50049257
Substrate
Meas. Tech.
ChEMBL_89358 (CHEMBL699688)
IC50
54000±n/a nM
Citation
 Hansen, DWPeterson, KBTrivedi, MKramer, SWWebber, RKTjoeng, FSMoore, WMJerome, GMKornmeier, CMManning, PTConnor, JRMisko, TPCurrie, MGPitzele, BS 2-Iminohomopiperidinium salts as selective inhibitors of inducible nitric oxide synthase (iNOS). J Med Chem 41:1361-6 (1998)  
Target
Name:
Nitric oxide synthase, inducible
Synonyms:
Inducible NO synthase Inducible nitric oxide synthase (iNOS) MAC-NOS NOS type II Nitric Oxide Synthase, inducible Nos2
Type:
Enzyme
Mol. Mass.:
130595.79
Organism:
Mus musculus (mouse)
Description:
Recombinant enzyme overexpressed in E. coli.
Residue:
1144
  
Inhibitor
Name:
BDBM50049257
Synonyms:
Azepan-(2Z)-ylideneamine CHEMBL543752
Type:
Small organic molecule
Emp. Form.:
C6H12N2
Mol. Mass.:
112.1729
SMILES:
NC1=NCCCCC1
: