Target
Nitric oxide synthase, inducible
Ligand
BDBM50049257
Substrate
Meas. Tech.
ChEMBL_89193 (CHEMBL701145)
IC50
2100±n/a nM
Citation
 Hansen, DWPeterson, KBTrivedi, MKramer, SWWebber, RKTjoeng, FSMoore, WMJerome, GMKornmeier, CMManning, PTConnor, JRMisko, TPCurrie, MGPitzele, BS 2-Iminohomopiperidinium salts as selective inhibitors of inducible nitric oxide synthase (iNOS). J Med Chem 41:1361-6 (1998)  
Target
Name:
Nitric oxide synthase, inducible
Synonyms:
HEP-NOS Inducible NO synthase NOS type II NOS2A Nitric oxide synthase, inducible (iNOS) | iNOS
Type:
Homodimer
Mol. Mass.:
131141.95
Organism:
Homo sapiens (Human)
Description:
P35228
Residue:
1153
  
Inhibitor
Name:
BDBM50049257
Synonyms:
Azepan-(2Z)-ylideneamine CHEMBL543752
Type:
Small organic molecule
Emp. Form.:
C6H12N2
Mol. Mass.:
112.1729
SMILES:
NC1=NCCCCC1
: