Target
Tyrosine-protein kinase Lck
Ligand
BDBM50074261
Substrate
Meas. Tech.
ChEMBL_221635 (CHEMBL823025)
Kd
200±n/a nM
Citation
 Beaulieu, PLCameron, DRFerland, JMGauthier, JGhiro, EGillard, JGorys, VPoirier, MRancourt, JWernic, DLlinas-Brunet, MBetageri, RCardozo, MHickey, ERIngraham, RJakes, SKabcenell, AKirrane, TLukas, SPatel, UProudfoot, JSharma, RTong, LMoss, N Ligands for the tyrosine kinase p56lck SH2 domain: discovery of potent dipeptide derivatives with monocharged, nonhydrolyzable phosphate replacements. J Med Chem 42:1757-66 (1999)  
Target
Name:
Tyrosine-protein kinase Lck
Synonyms:
2.7.10.2 LCK_HUMAN Leukocyte C-terminal Src kinase Lymphocyte-specific protein tyrosine kinase Protein YT16 Proto-oncogene tyrosine-protein kinase LCK T cell-specific protein-tyrosine kinase
Type:
Mol. Mass.:
57987.83
Organism:
Homo sapiens (Human)
Description:
P06239
Residue:
509
  
Inhibitor
Name:
BDBM50074261
Synonyms:
(S)-4-[(S)-2-Acetylamino-3-(4-phosphonooxy-phenyl)-propionylamino]-4-(4-methoxy-benzylcarbamoyl)-butyric acid | CHEMBL413096
Type:
Small organic molecule
Emp. Form.:
C24H30N3O10P
Mol. Mass.:
551.4829
SMILES:
COc1ccc(CNC(=O)[C@H](CCC(O)=O)NC(=O)[C@H](Cc2ccc(OP(O)(O)=O)cc2)NC(C)=O)cc1
: