Target
Tyrosine-protein kinase Lck
Ligand
BDBM50077198
Substrate
Meas. Tech.
ChEMBL_221635 (CHEMBL823025)
Kd
3000±n/a nM
Citation
 Beaulieu, PLCameron, DRFerland, JMGauthier, JGhiro, EGillard, JGorys, VPoirier, MRancourt, JWernic, DLlinas-Brunet, MBetageri, RCardozo, MHickey, ERIngraham, RJakes, SKabcenell, AKirrane, TLukas, SPatel, UProudfoot, JSharma, RTong, LMoss, N Ligands for the tyrosine kinase p56lck SH2 domain: discovery of potent dipeptide derivatives with monocharged, nonhydrolyzable phosphate replacements. J Med Chem 42:1757-66 (1999)  
Target
Name:
Tyrosine-protein kinase Lck
Synonyms:
2.7.10.2 LCK_HUMAN Leukocyte C-terminal Src kinase Lymphocyte-specific protein tyrosine kinase Protein YT16 Proto-oncogene tyrosine-protein kinase LCK T cell-specific protein-tyrosine kinase
Type:
Mol. Mass.:
57987.83
Organism:
Homo sapiens (Human)
Description:
P06239
Residue:
509
  
Inhibitor
Name:
BDBM50077198
Synonyms:
(S)-4-(4-Methoxy-benzylcarbamoyl)-4-{(S)-2-(2-naphthalen-1-yl-acetylamino)-3-[4-(oxalyl-amino)-phenyl]-propionylamino}-butyric acid | CHEMBL297936
Type:
Small organic molecule
Emp. Form.:
C36H36N4O9
Mol. Mass.:
668.6924
SMILES:
COc1ccc(CNC(=O)[C@H](CCC(O)=O)NC(=O)[C@H](Cc2ccc(NC(=O)C(O)=O)cc2)NC(=O)Cc2cccc3ccccc23)cc1
: