Target
Gag-Pol polyprotein [489-587]
Ligand
BDBM150
Substrate
Meas. Tech.
ChEMBL_196355 (CHEMBL878547)
IC50
110±n/a nM
Citation
 Tyndall, JDReid, RCTyssen, DPJardine, DKTodd, BPassmore, MMarch, DRPattenden, LKBergman, DAAlewood, DHu, SHAlewood, PFBirch, CJMartin, JLFairlie, DP Synthesis, stability, antiviral activity, and protease-bound structures of substrate-mimicking constrained macrocyclic inhibitors of HIV-1 protease. J Med Chem 43:3495-504 (2000)  
Target
Name:
Gag-Pol polyprotein [489-587]
Synonyms:
Human immunodeficiency virus type 1 protease Pol polyprotein | gag-pol
Type:
Enzyme Subunit
Mol. Mass.:
10781.16
Organism:
Human immunodeficiency virus type 1
Description:
P04585[489-587]
Residue:
99
  
Inhibitor
Name:
BDBM150
Synonyms:
(4R,5S,6S,7R)-4,7-dibenzyl-5,6-dihydroxy-1,3-bis({[4-(hydroxymethyl)phenyl]methyl})-1,3-diazepan-2-one | DMP323
Type:
Emp. Form.:
C35H38N2O5
Mol. Mass.:
566.6866
SMILES:
OCc1ccc(CN2[C@H](Cc3ccccc3)[C@H](O)[C@@H](O)[C@@H](Cc3ccccc3)N(Cc3ccc(CO)cc3)C2=O)cc1
: