Target
Endothelin-1 receptor
Ligand
BDBM50369953
Substrate
Meas. Tech.
ChEMBL_65637 (CHEMBL681519)
Ki
0.015±n/a nM
Citation
 Morimoto, HOhashi, NShimadzu, HKushiyama, EKawanishi, HHosaka, TKawase, YYasuda, KKikkawa, KYamauchi-Kohno, RYamada, K Potent and selective ET-A antagonists. 2. Discovery and evaluation of potent and water soluble N-(6-(2-(aryloxy)ethoxy)-4-pyrimidinyl)sulfonamide derivatives. J Med Chem 44:3369-77 (2001)  
Target
Name:
Endothelin-1 receptor
Synonyms:
EDNRA ET-A ETA-R Endothelin receptor type A hET-AR
Type:
Enzyme Catalytic Domain
Mol. Mass.:
48736.88
Organism:
Homo sapiens (Human)
Description:
P25101
Residue:
427
  
Inhibitor
Name:
BDBM50369953
Synonyms:
CHEMBL1627022
Type:
Small organic molecule
Emp. Form.:
C27H27BrN5O5S
Mol. Mass.:
613.503
SMILES:
Cc1ccc(cc1)-c1c([N-]S(=O)(=O)c2ccc(cc2)C(C)(C)CO)ncnc1OCCOc1ncc(Br)cn1
: