Target
Glutamate receptor 3
Ligand
BDBM50207594
Substrate
Meas. Tech.
ChEMBL_90291 (CHEMBL697510)
Ki
900±n/a nM
Citation
 Filla, SAWinter, MAJohnson, KWBleakman, DBell, MGBleisch, TJCastaño, AMClemens-Smith, Adel Prado, MDieckman, DKDominguez, EEscribano, AHo, KHHudziak, KJKatofiasc, MAMartinez-Perez, JAMateo, AMathes, BMMattiuz, ELOgden, AMPhebus, LAStack, DRStratford, REOrnstein, PL Ethyl (3S,4aR,6S,8aR)-6-(4-ethoxycar- bonylimidazol-1-ylmethyl)decahydroiso-quinoline-3-carboxylic ester: a prodrug of a GluR5 kainate receptor antagonist active in two animal models of acute migraine. J Med Chem 45:4383-6 (2002)  
Target
Name:
Glutamate receptor 3
Synonyms:
AMPA-selective glutamate receptor 3 GLURC GRIA3_HUMAN GluR-C Glutamate receptor 3 Glutamate receptor ionotropic, AMPA 3
Type:
PROTEIN
Mol. Mass.:
101172.14
Organism:
Homo sapiens (Human)
Description:
ChEMBL_468627
Residue:
894
  
Inhibitor
Name:
BDBM50207594
Synonyms:
2,3-Dihydroxy-6-nitro-benzo[f]quinoxaline-7-sulfonic acid amide 2,3-dihydroxy-6-nitro-7-sulfamoylbenzo(f)quinoxaline 6-Nitro-2,3-dioxo-1,2,3,4,4a,10b-hexahydro-benzo[f]quinoxaline-7-sulfonic acid amide 6-Nitro-2,3-dioxo-1,2,3,4-tetrahydro-benzo[f]quinoxaline-7-sulfonic acid amide 6-nitro-2,3-dioxo-1,2,3,4-tetrahydrobenzo[f]quinoxaline-7-sulfonamide | CHEMBL222519
Type:
Small organic molecule
Emp. Form.:
C12H8N4O6S
Mol. Mass.:
336.28
SMILES:
NS(=O)(=O)c1cccc2c1c(cc1[nH]c(=O)c(=O)[nH]c21)[N+]([O-])=O
: