Target
Glucocorticoid receptor
Ligand
BDBM50150341
Substrate
Meas. Tech.
ChEMBL_305749 (CHEMBL829520)
IC50
170±n/a nM
Citation
 Tu, NLink, JTSorensen, BKEmery, MGrynfarb, MGoos-Nilsson, ANguyen, B Bile acid conjugates of a nonsteroidal glucocorticoid receptor modulator. Bioorg Med Chem Lett 14:4179-83 (2004)  
Target
Name:
Glucocorticoid receptor
Synonyms:
GCR_HUMAN GRL Glucocorticoid receptor (GRFP) Nuclear receptor subfamily 3 group C member 1
Type:
Enzyme
Mol. Mass.:
85656.87
Organism:
Homo sapiens (Human)
Description:
P04150
Residue:
777
  
Inhibitor
Name:
BDBM50150341
Synonyms:
4-(4-{[(3-Methanesulfonylamino-2-methyl-phenyl)-(4-phenoxy-benzyl)-amino]-methyl}-phenyl)-butyric acid | CHEMBL184308
Type:
Small organic molecule
Emp. Form.:
C32H34N2O5S
Mol. Mass.:
558.688
SMILES:
Cc1c(NS(C)(=O)=O)cccc1N(Cc1ccc(CCCC(O)=O)cc1)Cc1ccc(Oc2ccccc2)cc1
: