Target
Glucocorticoid receptor
Ligand
BDBM50150353
Substrate
Meas. Tech.
ChEMBL_312728 (CHEMBL834764)
IC50
590±n/a nM
Citation
 Tu, NLink, JTSorensen, BKEmery, MGrynfarb, MGoos-Nilsson, ANguyen, B Bile acid conjugates of a nonsteroidal glucocorticoid receptor modulator. Bioorg Med Chem Lett 14:4179-83 (2004)  
Target
Name:
Glucocorticoid receptor
Synonyms:
GCR_HUMAN GRL Glucocorticoid receptor (GRFP) Nuclear receptor subfamily 3 group C member 1
Type:
Enzyme
Mol. Mass.:
85656.87
Organism:
Homo sapiens (Human)
Description:
P04150
Residue:
777
  
Inhibitor
Name:
BDBM50150353
Synonyms:
CHEMBL264841 | Methanesulfonamide derivative
Type:
Small organic molecule
Emp. Form.:
C56H73N3O10S
Mol. Mass.:
980.258
SMILES:
C[C@H](CCC(O)=O)[C@H]1CC[C@H]2[C@@H]3[C@H](O)C[C@@H]4C[C@H](CC[C@]4(C)[C@H]3C[C@H](O)[C@]12C)OCCNC(=O)COc1cccc(Oc2ccc(CN(Cc3ccccc3)c3cccc(NS(C)(=O)=O)c3C)cc2)c1
: