Target
Nitric oxide synthase, endothelial
Ligand
BDBM50066778
Substrate
Meas. Tech.
ChEMBL_305165 (CHEMBL832755)
IC50
520±n/a nM
Citation
 Shankaran, KDonnelly, KLShah, SKGuthikonda, RNMacCoss, MHumes, JLPacholok, SGGrant, SKKelly, TMWong, KK Evaluation of pyrrolidin-2-imines and 1,3-thiazolidin-2-imines as inhibitors of nitric oxide synthase. Bioorg Med Chem Lett 14:4539-44 (2004)  
Target
Name:
Nitric oxide synthase, endothelial
Synonyms:
Constitutive NOS Endothelial NOS NOS type III NOS3_HUMAN Nitric oxide synthase (inducible and endothelial) Nitric-oxide synthase (endothelial and brain) eNOS
Type:
Enzyme Catalytic Domain
Mol. Mass.:
133297.84
Organism:
Homo sapiens (Human)
Description:
P29474
Residue:
1203
  
Inhibitor
Name:
BDBM50066778
Synonyms:
5-Ethyl-4-methyl-pyrrolidin-(2E)-ylideneamine; hydrochloride CHEMBL552935
Type:
Small organic molecule
Emp. Form.:
C7H14N2
Mol. Mass.:
126.1995
SMILES:
CCC1N=C(N)CC1C
: