Target
Nitric oxide synthase, inducible
Ligand
BDBM50150920
Substrate
Meas. Tech.
ChEMBL_305090 (CHEMBL832395)
IC50
900±n/a nM
Citation
 Shankaran, KDonnelly, KLShah, SKGuthikonda, RNMacCoss, MHumes, JLPacholok, SGGrant, SKKelly, TMWong, KK Evaluation of pyrrolidin-2-imines and 1,3-thiazolidin-2-imines as inhibitors of nitric oxide synthase. Bioorg Med Chem Lett 14:4539-44 (2004)  
Target
Name:
Nitric oxide synthase, inducible
Synonyms:
HEP-NOS Inducible NO synthase NOS type II NOS2A Nitric oxide synthase, inducible (iNOS) | iNOS
Type:
Homodimer
Mol. Mass.:
131141.95
Organism:
Homo sapiens (Human)
Description:
P35228
Residue:
1153
  
Inhibitor
Name:
BDBM50150920
Synonyms:
2-AMINOTHIAZOLINE CHEMBL362148 | Thiazolidin-(2E)-ylideneamine
Type:
Small organic molecule
Emp. Form.:
C3H6N2S
Mol. Mass.:
102.158
SMILES:
NC1=NCCS1
: