Target
Nitric oxide synthase, endothelial
Ligand
BDBM50049251
Substrate
Meas. Tech.
ChEMBL_305165 (CHEMBL832755)
IC50
4600±n/a nM
Citation
 Shankaran, KDonnelly, KLShah, SKGuthikonda, RNMacCoss, MHumes, JLPacholok, SGGrant, SKKelly, TMWong, KK Evaluation of pyrrolidin-2-imines and 1,3-thiazolidin-2-imines as inhibitors of nitric oxide synthase. Bioorg Med Chem Lett 14:4539-44 (2004)  
Target
Name:
Nitric oxide synthase, endothelial
Synonyms:
Constitutive NOS Endothelial NOS NOS type III NOS3_HUMAN Nitric oxide synthase (inducible and endothelial) Nitric-oxide synthase (endothelial and brain) eNOS
Type:
Enzyme Catalytic Domain
Mol. Mass.:
133297.84
Organism:
Homo sapiens (Human)
Description:
P29474
Residue:
1203
  
Inhibitor
Name:
BDBM50049251
Synonyms:
CHEMBL161318 Pyrrolidin-(2Z)-ylideneamine
Type:
Small organic molecule
Emp. Form.:
C4H8N2
Mol. Mass.:
84.1197
SMILES:
NC1=NCCC1
: