Target
Nitric oxide synthase, inducible
Ligand
BDBM50150935
Substrate
Meas. Tech.
ChEMBL_305090 (CHEMBL832395)
IC50
3100±n/a nM
Citation
 Shankaran, KDonnelly, KLShah, SKGuthikonda, RNMacCoss, MHumes, JLPacholok, SGGrant, SKKelly, TMWong, KK Evaluation of pyrrolidin-2-imines and 1,3-thiazolidin-2-imines as inhibitors of nitric oxide synthase. Bioorg Med Chem Lett 14:4539-44 (2004)  
Target
Name:
Nitric oxide synthase, inducible
Synonyms:
HEP-NOS Inducible NO synthase NOS type II NOS2A Nitric oxide synthase, inducible (iNOS) | iNOS
Type:
Homodimer
Mol. Mass.:
131141.95
Organism:
Homo sapiens (Human)
Description:
P35228
Residue:
1153
  
Inhibitor
Name:
BDBM50150935
Synonyms:
CHEMBL365849 | Hexahydro-cyclopenta[c]pyrrol-(1Z)-ylideneamine
Type:
Small organic molecule
Emp. Form.:
C7H12N2
Mol. Mass.:
124.1836
SMILES:
NC1=NCC2CCCC12
: