Target
Nitric oxide synthase, brain
Ligand
BDBM50066785
Substrate
Meas. Tech.
ChEMBL_305039 (CHEMBL831677)
IC50
4800±n/a nM
Citation
 Shankaran, KDonnelly, KLShah, SKGuthikonda, RNMacCoss, MHumes, JLPacholok, SGGrant, SKKelly, TMWong, KK Evaluation of pyrrolidin-2-imines and 1,3-thiazolidin-2-imines as inhibitors of nitric oxide synthase. Bioorg Med Chem Lett 14:4539-44 (2004)  
Target
Name:
Nitric oxide synthase, brain
Synonyms:
Constitutive NOS NC-NOS NOS type I nNOS NOS1_HUMAN Neuronal nitric oxide synthase Nitric oxide synthase, neuronal (nNOS) bNOS | nNOS
Type:
Homodimer
Mol. Mass.:
160985.98
Organism:
Homo sapiens (Human)
Description:
P29475
Residue:
1434
  
Inhibitor
Name:
BDBM50066785
Synonyms:
4-Methyl-5-propyl-pyrrolidin-(2E)-ylideneamine; hydrochloride CHEMBL541081
Type:
Small organic molecule
Emp. Form.:
C8H16N2
Mol. Mass.:
140.226
SMILES:
CCCC1N=C(N)CC1C
: