Target
Beta-2 adrenergic receptor
Ligand
BDBM86453
Substrate
Meas. Tech.
ChEMBL_302767 (CHEMBL876356)
Ki
2.6±n/a nM
Citation
 Alikhani, VBeer, DBentley, DBruce, ICuenoud, BMFairhurst, RAGedeck, PHaberthuer, SHayden, CJanus, DJordan, LLewis, CSmithies, KWissler, E Long-chain formoterol analogues: an investigation into the effect of increasing amino-substituent chain length on the beta2-adrenoceptor activity. Bioorg Med Chem Lett 14:4705-10 (2004)  
Target
Name:
Beta-2 adrenergic receptor
Synonyms:
ADRB2 ADRB2_HUMAN Beta-2 adrenoceptor | Beta-2 adrenoreceptor
Type:
Mol. Mass.:
46461.69
Organism:
Homo sapiens (Human)
Description:
P07550
Residue:
413
  
Inhibitor
Name:
BDBM86453
Synonyms:
CAS_73573-87-2 NSC_3083544
Type:
Small organic molecule
Emp. Form.:
C19H24N2O4
Mol. Mass.:
344.4049
SMILES:
COc1ccc(CC(C)NCC(O)c2ccc(O)c(NC=O)c2)cc1
: