Target
Protein farnesyltransferase subunit beta/geranylgeranyltransferase type-1 subunit alpha
Ligand
BDBM50164012
Substrate
Meas. Tech.
ChEMBL_312466 (CHEMBL833084)
IC50
100±n/a nM
Citation
 Lombardo, LJCamuso, AClark, JFager, KGullo-Brown, JHunt, JTInigo, IKan, DKoplowitz, BLee, FMcGlinchey, KQian, LRicca, CRovnyak, GTraeger, STokarski, JWilliams, DKWu, LIZhao, YManne, VBhide, RS Design, synthesis, and structure-activity relationships of tetrahydroquinoline-based farnesyltransferase inhibitors. Bioorg Med Chem Lett 15:1895-9 (2005)  
Target
Name:
Protein farnesyltransferase subunit beta/geranylgeranyltransferase type-1 subunit alpha
Synonyms:
Protein Farnesyltransferase (PFT)/farnesyltransferase beta subunit | Protein farnesyltransferase
Type:
Mol. Mass.:
Description:
ASSAY_ID of EBI is 69815
Components:
This complex has 2 components.
Component 1
Name:
Protein farnesyltransferase subunit beta
Synonyms:
CAAX farnesyltransferase subunit beta FTase-beta Protein farnesyltransferase Ras proteins prenyltransferase subunit beta
Type:
PROTEIN
Mol. Mass.:
48666.41
Organism:
Rattus norvegicus
Description:
EBI_10573
Residue:
437
  
Component 2
Name:
Protein farnesyltransferase/geranylgeranyltransferase type-1 subunit alpha
Synonyms:
CAAX farnesyltransferase alpha subunit FTase-alpha GGTase-I-alpha Protein farnesyltransferase/geranylgeranyltransferase type I alpha subunit Type I protein geranyl-geranyltransferase alpha subunit | geranylgeranyltransferase type-I
Type:
Enzyme
Mol. Mass.:
44030.14
Organism:
Rattus norvegicus (rat)
Description:
Recombinant rat enzyme.
Residue:
377
  
Inhibitor
Name:
BDBM50164012
Synonyms:
CHEMBL183217 | Pyridine-3-sulfonic acid [6-cyano-1-(3-methyl-3H-imidazol-4-ylmethyl)-1,2,3,4-tetrahydro-quinolin-3-yl]-(2-methyl-allyl)-amide
Type:
Small organic molecule
Emp. Form.:
C24H26N6O2S
Mol. Mass.:
462.567
SMILES:
CC(=C)CN(C1CN(Cc2cncn2C)c2ccc(cc2C1)C#N)S(=O)(=O)c1cccnc1
: