Target
Progesterone receptor
Ligand
BDBM50151068
Substrate
Meas. Tech.
ChEMBL_302537 (CHEMBL827389)
Ki
1.1±n/a nM
Citation
 von Geldern, TWTu, NKym, PRLink, JTJae, HSLai, CApelqvist, TRhonnstad, PHagberg, LKoehler, KGrynfarb, MGoos-Nilsson, ASandberg, JOsterlund, MBarkhem, THöglund, MWang, JFung, SWilcox, DNguyen, PJakob, CHutchins, CFärnegårdh, MKauppi, BOhman, LJacobson, PB Liver-selective glucocorticoid antagonists: a novel treatment for type 2 diabetes. J Med Chem 47:4213-30 (2004)  
Target
Name:
Progesterone receptor
Synonyms:
NR3C3 PGR PRGR_HUMAN | progesterone
Type:
Protein
Mol. Mass.:
98979.52
Organism:
Homo sapiens (Human)
Description:
P06401
Residue:
933
  
Inhibitor
Name:
BDBM50151068
Synonyms:
(4R)-4-[(1S,2S,7R,9R,10R,11S,14R,15R,16S)-5-[3-({4-[(10S,11S,14R,15S,17R)-14-ethynyl-14-hydroxy-15-methyl-5-oxotetracyclo[8.7.0.0^{2,7}.0^{11,15}]heptadeca-1,6-dien-17-yl]phenyl}(methyl)amino)propoxy]-9,16-dihydroxy-2,15-dimethyltetracyclo[8.7.0.0^{2,7}.0^{11,15}]heptadecan-14-yl]pentanoic acid | CHEMBL415621
Type:
Small organic molecule
Emp. Form.:
C54H75NO7
Mol. Mass.:
850.1758
SMILES:
C[C@H](CCC(O)=O)[C@H]1CC[C@H]2[C@@H]3[C@H](O)C[C@@H]4CC(CC[C@]4(C)[C@H]3C[C@H](O)[C@]12C)OCCCN(C)c1ccc(cc1)[C@H]1C[C@@]2(C)[C@@H](CC[C@@]2(O)C#C)[C@@H]2CCC3=CC(=O)CCC3=C12
: