Target
Thyroid hormone receptor alpha
Ligand
BDBM18627
Substrate
Meas. Tech.
ChEMBL_302715 (CHEMBL839586)
Ki
>1250±n/a nM
Citation
 von Geldern, TWTu, NKym, PRLink, JTJae, HSLai, CApelqvist, TRhonnstad, PHagberg, LKoehler, KGrynfarb, MGoos-Nilsson, ASandberg, JOsterlund, MBarkhem, THöglund, MWang, JFung, SWilcox, DNguyen, PJakob, CHutchins, CFärnegårdh, MKauppi, BOhman, LJacobson, PB Liver-selective glucocorticoid antagonists: a novel treatment for type 2 diabetes. J Med Chem 47:4213-30 (2004)  
Target
Name:
Thyroid hormone receptor alpha
Synonyms:
C-erbA-alpha EAR7 NR1A1 THA_HUMAN THRA1 Thyroid Hormone Receptor (TR-alpha) Thyroid hormone receptor alpha c-erbA-1
Type:
Receptor
Mol. Mass.:
54818.00
Organism:
Homo sapiens (Human)
Description:
Recombinant hThR was obtained from nuclear extracts from SF9 cells infected with baculovirus vectors encoding for ThRalpha 1.
Residue:
490
  
Inhibitor
Name:
BDBM18627
Synonyms:
(10S,11S,14S,15S,17R)-17-[4-(dimethylamino)phenyl]-14-hydroxy-15-methyl-14-(prop-1-yn-1-yl)tetracyclo[8.7.0.0^{2,7}.0^{11,15}]heptadeca-1,6-dien-5-one Mifepristone RU486 (tetramethyl-rhodamine conjugated)
Type:
Small organic molecule
Emp. Form.:
C29H35NO2
Mol. Mass.:
429.5937
SMILES:
[H][C@@]12CC[C@@](O)(C#CC)[C@@]1(C)C[C@@H](C1=C3CCC(=O)C=C3CC[C@@]21[H])c1ccc(cc1)N(C)C
: