Target
Neuronal acetylcholine receptor subunit alpha-7
Ligand
BDBM50164612
Substrate
Meas. Tech.
ChEMBL_303347 (CHEMBL839662)
Ki
80±n/a nM
Citation
 Tatsumi, RFujio, MSatoh, HKatayama, JTakanashi, SHashimoto, KTanaka, H Discovery of the alpha7 nicotinic acetylcholine receptor agonists. (R)-3'-(5-Chlorothiophen-2-yl)spiro-1-azabicyclo[2.2.2]octane-3,5'-[1',3']oxazolidin-2'-one as a novel, potent, selective, and orally bioavailable ligand. J Med Chem 48:2678-86 (2005)  
Target
Name:
Neuronal acetylcholine receptor subunit alpha-7
Synonyms:
ACHA7_RAT Cholinergic, Nicotinic Alpha7 Chrna7 Neuronal acetylcholine receptor (alpha7 nAChR) Neuronal acetylcholine receptor subunit alpha-7 Neuronal acetylcholine receptor subunit alpha-7 (nAChR)
Type:
Enzyme
Mol. Mass.:
56502.44
Organism:
Rattus norvegicus (Rat)
Description:
Q05941
Residue:
502
  
Inhibitor
Name:
BDBM50164612
Synonyms:
(2R)-3'-thien-2-yl-2'H-spiro[4-azabicyclo[2.2.2]octane-2,5'-[1,3]oxazolidin]-2'-one | CHEMBL362962
Type:
Small organic molecule
Emp. Form.:
C13H16N2O2S
Mol. Mass.:
264.343
SMILES:
O=C1O[C@@]2(CN1c1cccs1)CN1CCC2CC1
: