Target
Neuronal acetylcholine receptor subunit alpha-7
Ligand
BDBM50149147
Substrate
Meas. Tech.
ChEMBL_303347 (CHEMBL839662)
Ki
65±n/a nM
Citation
 Tatsumi, RFujio, MSatoh, HKatayama, JTakanashi, SHashimoto, KTanaka, H Discovery of the alpha7 nicotinic acetylcholine receptor agonists. (R)-3'-(5-Chlorothiophen-2-yl)spiro-1-azabicyclo[2.2.2]octane-3,5'-[1',3']oxazolidin-2'-one as a novel, potent, selective, and orally bioavailable ligand. J Med Chem 48:2678-86 (2005)  
Target
Name:
Neuronal acetylcholine receptor subunit alpha-7
Synonyms:
ACHA7_RAT Cholinergic, Nicotinic Alpha7 Chrna7 Neuronal acetylcholine receptor (alpha7 nAChR) Neuronal acetylcholine receptor subunit alpha-7 Neuronal acetylcholine receptor subunit alpha-7 (nAChR)
Type:
Enzyme
Mol. Mass.:
56502.44
Organism:
Rattus norvegicus (Rat)
Description:
Q05941
Residue:
502
  
Inhibitor
Name:
BDBM50149147
Synonyms:
2-(1-Aza-bicyclo[2.2.2]oct-3-yl)-1-benzo[b]thiophen-2-yl-ethanone | CHEMBL420156
Type:
Small organic molecule
Emp. Form.:
C17H19NOS
Mol. Mass.:
285.404
SMILES:
O=C(CC1CN2CCC1CC2)c1cc2ccccc2s1
: