Target
Prothrombin
Ligand
BDBM50177422
Substrate
Meas. Tech.
ChEMBL_334615 (CHEMBL862522)
IC50
250±n/a nM
Citation
 Hanessian, STherrien, Evan Otterlo, WABayrakdarian, MNilsson, IFjellström, OXue, Y Phenolic P2/P3 core motif as thrombin inhibitors--design, synthesis, and X-ray co-crystal structure. Bioorg Med Chem Lett 16:1032-6 (2006)  
Target
Name:
Prothrombin
Synonyms:
Activation peptide fragment 1 Coagulation factor II Prothrombin precursor Thrombin heavy chain | Thrombin light chain
Type:
Protein
Mol. Mass.:
70029.57
Organism:
Homo sapiens (Human)
Description:
P00734
Residue:
622
  
Inhibitor
Name:
BDBM50177422
Synonyms:
CHEMBL541902 | N-(4-carbamimidoylbenzyl)-2-(2-hydroxy-6-methyl-3-(4-methylphenylsulfonamido)phenyl)acetamide hydrochloride
Type:
Small organic molecule
Emp. Form.:
C24H26N4O4S
Mol. Mass.:
466.553
SMILES:
Cc1ccc(cc1)S(=O)(=O)Nc1ccc(C)c(CC(=O)NCc2ccc(cc2)C(N)=N)c1O
: