Target
Prothrombin
Ligand
BDBM50177424
Substrate
Meas. Tech.
ChEMBL_334615 (CHEMBL862522)
IC50
120±n/a nM
Citation
 Hanessian, STherrien, Evan Otterlo, WABayrakdarian, MNilsson, IFjellström, OXue, Y Phenolic P2/P3 core motif as thrombin inhibitors--design, synthesis, and X-ray co-crystal structure. Bioorg Med Chem Lett 16:1032-6 (2006)  
Target
Name:
Prothrombin
Synonyms:
Activation peptide fragment 1 Coagulation factor II Prothrombin precursor Thrombin heavy chain | Thrombin light chain
Type:
Protein
Mol. Mass.:
70029.57
Organism:
Homo sapiens (Human)
Description:
P00734
Residue:
622
  
Inhibitor
Name:
BDBM50177424
Synonyms:
CHEMBL536280 | N-(4-carbamimidoylbenzyl)-2-(2-hydroxy-6-methyl-3-(3-(trifluoromethyl)phenylsulfonamido)phenyl)acetamide hydrochloride
Type:
Small organic molecule
Emp. Form.:
C24H23F3N4O4S
Mol. Mass.:
520.524
SMILES:
Cc1ccc(NS(=O)(=O)c2cccc(c2)C(F)(F)F)c(O)c1CC(=O)NCc1ccc(cc1)C(N)=N
: