Target
Aryl hydrocarbon receptor
Ligand
BDBM50191415
Substrate
Meas. Tech.
ChEMBL_365417 (CHEMBL867900)
IC50
>30000±n/a nM
Citation
 Ferandin, YBettayeb, KKritsanida, MLozach, OPolychronopoulos, PMagiatis, PSkaltsounis, ALMeijer, L 3'-Substituted 7-halogenoindirubins, a new class of cell death inducing agents. J Med Chem 49:4638-49 (2006)  
Target
Name:
Aryl hydrocarbon receptor
Synonyms:
AHR BHLHE76 aryl hydrocarbon receptor precursor
Type:
PROTEIN
Mol. Mass.:
96143.77
Organism:
Homo sapiens (Human)
Description:
ChEMBL_1503828
Residue:
848
  
Inhibitor
Name:
BDBM50191415
Synonyms:
(2'Z,3'E)-7-bromoindirubin-3'-[O-(2-pyrrolidin-1-ylethyl)oxime] hydrochloride | CHEMBL211430
Type:
Small organic molecule
Emp. Form.:
C22H22BrN4O2
Mol. Mass.:
454.339
SMILES:
Oc1[nH]c2c(Br)cccc2c1C1=Nc2ccccc2\C1=N/OCC[NH+]1CCCC1
: