Target
Aryl hydrocarbon receptor
Ligand
BDBM50191411
Substrate
Meas. Tech.
ChEMBL_365417 (CHEMBL867900)
IC50
>30000±n/a nM
Citation
 Ferandin, YBettayeb, KKritsanida, MLozach, OPolychronopoulos, PMagiatis, PSkaltsounis, ALMeijer, L 3'-Substituted 7-halogenoindirubins, a new class of cell death inducing agents. J Med Chem 49:4638-49 (2006)  
Target
Name:
Aryl hydrocarbon receptor
Synonyms:
AHR BHLHE76 aryl hydrocarbon receptor precursor
Type:
PROTEIN
Mol. Mass.:
96143.77
Organism:
Homo sapiens (Human)
Description:
ChEMBL_1503828
Residue:
848
  
Inhibitor
Name:
BDBM50191411
Synonyms:
(2'Z,3'E)-7-bromoindirubin-3'-[O-(2-dimethylaminoethyl)oxime] hydrochloride | CHEMBL378198
Type:
Small organic molecule
Emp. Form.:
C20H20BrN4O2
Mol. Mass.:
428.302
SMILES:
C[NH+](C)CCO\N=C1\C(=Nc2ccccc12)c1c(O)[nH]c2c(Br)cccc12
: