Target
Cyclin-dependent kinase 5 activator 1
Ligand
BDBM50191391
Substrate
Meas. Tech.
ChEMBL_365406 (CHEMBL867889)
IC50
>100000±n/a nM
Citation
 Ferandin, YBettayeb, KKritsanida, MLozach, OPolychronopoulos, PMagiatis, PSkaltsounis, ALMeijer, L 3'-Substituted 7-halogenoindirubins, a new class of cell death inducing agents. J Med Chem 49:4638-49 (2006)  
Target
Name:
Cyclin-dependent kinase 5 activator 1
Synonyms:
CDK5/p35 Cyclin-dependent kinase 5 regulatory subunit 1 | Cyclin-dependent kinase 5/CDK5 activator 1
Type:
Protein Complex
Mol. Mass.:
Description:
Components:
This complex has 2 components.
Component 1
Name:
Cyclin-dependent kinase 5
Synonyms:
CDK5 CDKN5 Cyclin-dependent kinase 5 (CDK5/ p25) Cyclin-dependent-like kinase 5 PSSALRE Tau protein kinase II catalytic subunit
Type:
Enzyme Subunit
Mol. Mass.:
33308.61
Organism:
Homo sapiens (Human)
Description:
Residue:
292
  
Component 2
Name:
Cyclin-dependent kinase 5 activator 1
Synonyms:
CD5R1_HUMAN CDK5R1 Cyclin-dependent kinase 5 (CDK5/p25) NCK5A p35
Type:
Enzyme Subunit
Mol. Mass.:
34077.43
Organism:
Homo sapiens (Human)
Description:
Q15078
Residue:
307
  
Inhibitor
Name:
BDBM50191391
Synonyms:
(2'Z,3'E)-7-fluoroindirubin-3'-acetoxime | CHEMBL210073
Type:
Small organic molecule
Emp. Form.:
C18H12FN3O3
Mol. Mass.:
337.3046
SMILES:
CC(=O)ON=C1C(=Nc2ccccc12)c1c(O)[nH]c2c(F)cccc12
: