Target
C-C chemokine receptor type 2
Ligand
BDBM50196700
Substrate
Meas. Tech.
ChEMBL_432048 (CHEMBL918245)
IC50
19000±n/a nM
Citation
 Iwakubo, MTakami, AOkada, YKawata, TTagami, YOhashi, HSato, MSugiyama, TFukushima, KIijima, H Design and synthesis of Rho kinase inhibitors (II). Bioorg Med Chem 15:350-64 (2006)  
Target
Name:
C-C chemokine receptor type 2
Synonyms:
C-C chemokine receptor type 2 (CCR2) CCR2_HUMAN Chemoattractant Cytokine Receptor 2 (CCR2) Monocyte chemotactic protein-1 (MCP-1)
Type:
Enzyme
Mol. Mass.:
41932.32
Organism:
Homo sapiens (Human)
Description:
P41597
Residue:
374
  
Inhibitor
Name:
BDBM50196700
Synonyms:
5-((3-(3-(prop-1-en-2-yl)benzyl)cyclohexyl)methyl)-1H-indene N-[1-(3-nitrobenzyl)-3-piperidyl]-N-(1H-5-indazolyl)amine
Type:
Small organic molecule
Emp. Form.:
C19H21N5O2
Mol. Mass.:
351.4023
SMILES:
[O-][N+](=O)c1cccc(CN2CCCC(C2)Nc2ccc3[nH]ncc3c2)c1
: