Target
Sodium-dependent serotonin transporter
Ligand
BDBM50209685
Substrate
Meas. Tech.
ChEMBL_436123 (CHEMBL905525)
Ki
2.10±n/a nM
Citation
 Andrés, JIAlcázar, JAlonso, JMAlvarez, RMBakker, MHBiesmans, ICid, JMDe Lucas, AIDrinkenburg, WFernández, JFont, LMIturrino, LLanglois, XLenaerts, IMartínez, SMegens, AAPastor, JPullan, SSteckler, T Tricyclic isoxazolines: identification of R226161 as a potential new antidepressant that combines potent serotonin reuptake inhibition and alpha2-adrenoceptor antagonism. Bioorg Med Chem 15:3649-60 (2007)  
Target
Name:
Sodium-dependent serotonin transporter
Synonyms:
5-HT Transporter 5HTT SC6A4_HUMAN SLC6A4 Serotonin transporter (5HTT) Sodium-dependent serotonin transporter (SERT) | Solute carrier family 6 member 4
Type:
Multi-pass membrane protein
Mol. Mass.:
70322.51
Organism:
Homo sapiens (Human)
Description:
P31645
Residue:
630
  
Inhibitor
Name:
BDBM50209685
Synonyms:
CHEMBL226636 cis-(+/-)-7,8-dimethoxy-3-[4-(3-(4-fluoro)phenyl-2(E)-propen-1-yl)piperazin-1-ylmethyl]-3a,4-dihydro-3H-[1]benzopyrano[4,3-c]isoxazole | cis-(-)-7,8-dimethoxy-3-[4-(3-(4-fluoro)phenyl-2(E)-propen-1-yl)piperazin-1-ylmethyl]-3a,4-dihydro-3H-[1]benzopyrano[4,3-c]isoxazole
Type:
Small organic molecule
Emp. Form.:
C26H30FN3O4
Mol. Mass.:
467.5325
SMILES:
COc1cc2OCC3C(CN4CCN(C\C=C\c5ccc(F)cc5)CC4)ON=C3c2cc1OC
: