Target
C-X-C chemokine receptor type 2
Ligand
BDBM50140794
Substrate
Meas. Tech.
ChEMBL_454110 (CHEMBL903301)
IC50
320±n/a nM
Citation
 McCleland, BWDavis, RSPalovich, MRWiddowson, KLWerner, MLBurman, MFoley, JJSchmidt, DBSarau, HMRogers, MSalyers, KLGorycki, PDRoethke, TJStelman, GJAzzarano, LMWard, KWBusch-Petersen, J Comparison of N,N'-diarylsquaramides and N,N'-diarylureas as antagonists of the CXCR2 chemokine receptor. Bioorg Med Chem Lett 17:1713-7 (2007)  
Target
Name:
C-X-C chemokine receptor type 2
Synonyms:
C-X-C chemokine receptor type 2 (CXCR-2) CD_antigen=CD182 CXCR-2 CXCR2_HUMAN GRO/MGSA receptor IL-8 receptor type 2 IL8RB | Interleukin-8 receptor B
Type:
Protein
Mol. Mass.:
40767.88
Organism:
Homo sapiens (Human)
Description:
P25025
Residue:
360
  
Inhibitor
Name:
BDBM50140794
Synonyms:
1-(2-Hydroxy-4-nitro-phenyl)-3-phenyl-urea CHEMBL280711
Type:
Small organic molecule
Emp. Form.:
C13H11N3O4
Mol. Mass.:
273.2441
SMILES:
Oc1cc(ccc1NC(=O)Nc1ccccc1)[N+]([O-])=O
: