Target
Delta-type opioid receptor
Ligand
BDBM50218795
Substrate
Meas. Tech.
ChEMBL_457105 (CHEMBL924481)
Ki
0.4±n/a nM
Citation
 Smith, TAThatcher, LNCoop, A 3-Hydroxy-4-methoxyindolomorphinans as delta opioid selective ligands. Bioorg Med Chem Lett 17:5175-6 (2007)  
Target
Name:
Delta-type opioid receptor
Synonyms:
Cytochrome P450 3A4 Delta opioid receptor Delta-type opioid receptor (DOR) OPRD_RAT Opioid receptor Opioid receptors; mu & delta Ror-a | Voltage-gated potassium channel
Type:
G Protein-Coupled Receptor (GPCR)
Mol. Mass.:
40465.04
Organism:
Rattus norvegicus (rat)
Description:
Competition binding assays were using CHO-K1 cell membranes expressing the opioid receptor.
Residue:
372
  
Inhibitor
Name:
BDBM50218795
Synonyms:
(1R,13S,14R)-24-(cyclopropylmethyl)-20-methoxy-4,24-diazahexacyclo[12.7.3.0^{1,13}.0^{3,11}.0^{5,10}.0^{16,21}]tetracosa-3(11),5(10),6,8,16,18,20-heptaene-13,19-diol | CHEMBL246002
Type:
Small organic molecule
Emp. Form.:
C27H30N2O3
Mol. Mass.:
430.5387
SMILES:
COc1c(O)ccc2C[C@H]3N(CC4CC4)CC[C@@]4(Cc5[nH]c6ccccc6c5C[C@@]34O)c12
: