Target
Glucocorticoid receptor
Ligand
BDBM50221150
Substrate
Meas. Tech.
ChEMBL_457478 (CHEMBL941996)
Ki
216±n/a nM
Citation
 Clark, RDRay, NCBlaney, PCrackett, PHHurley, CWilliams, KDyke, HJClark, DELockey, PMDevos, RWong, MWhite, ABelanoff, JK 2-Benzenesulfonyl-8a-benzyl-hexahydro-2H-isoquinolin-6-ones as selective glucocorticoid receptor antagonists. Bioorg Med Chem Lett 17:5704-8 (2007)  
Target
Name:
Glucocorticoid receptor
Synonyms:
GCR_HUMAN GRL Glucocorticoid receptor (GRFP) Nuclear receptor subfamily 3 group C member 1
Type:
Enzyme
Mol. Mass.:
85656.87
Organism:
Homo sapiens (Human)
Description:
P04150
Residue:
777
  
Inhibitor
Name:
BDBM50221150
Synonyms:
8a-benzyl-2-(4-methoxyphenylsulfonyl)-1,2,3,4,8,8a-hexahydroisoquinolin-6(7H)-one | CHEMBL247599
Type:
Small organic molecule
Emp. Form.:
C23H25NO4S
Mol. Mass.:
411.514
SMILES:
COc1ccc(cc1)S(=O)(=O)N1CCC2=CC(=O)CCC2(Cc2ccccc2)C1
: