Target
Glucocorticoid receptor
Ligand
BDBM50222089
Substrate
Meas. Tech.
ChEMBL_457751 (CHEMBL924028)
IC50
210±n/a nM
Citation
 Jin, CManikumar, GKepler, JACook, CEAllan, GFKiddoe, MBhattacharjee, SLinton, OLundeen, SGSui, Z Synthesis and identification of novel 11beta-aryl-4',5'-dihydrospiro[estra-4,9-diene-17beta,4'-oxazole] analogs with dissociated antiprogesterone activities. Bioorg Med Chem Lett 17:5754-7 (2007)  
Target
Name:
Glucocorticoid receptor
Synonyms:
GCR_HUMAN GRL Glucocorticoid receptor (GRFP) Nuclear receptor subfamily 3 group C member 1
Type:
Enzyme
Mol. Mass.:
85656.87
Organism:
Homo sapiens (Human)
Description:
P04150
Residue:
777
  
Inhibitor
Name:
BDBM50222089
Synonyms:
(3S,10'S,11'S,15'S,17'R)-17'-(4-acetylphenyl)-5-ethyl-15'-methyl-2-methylidene-2H-spiro[1,4-oxazole-3,14'-tetracyclo[8.7.0.0^{2,7}.0^{11,15}]heptadecane]-1',6'-dien-5'-one | CHEMBL250220
Type:
Small organic molecule
Emp. Form.:
C31H35NO3
Mol. Mass.:
469.6145
SMILES:
CCC1=N[C@]2(CC[C@H]3[C@@H]4CCC5=CC(=O)CCC5=C4[C@H](C[C@]23C)c2ccc(cc2)C(C)=O)C(=C)O1
: