Target
Dipeptidyl peptidase 8
Ligand
BDBM50232511
Substrate
Meas. Tech.
ChEMBL_461026 (CHEMBL944058)
IC50
8000±n/a nM
Citation
 Kim, DKowalchick, JEBrockunier, LLParmee, EREiermann, GJFisher, MHHe, HLeiting, BLyons, KScapin, GPatel, SBPetrov, APryor, KDRoy, RSWu, JKZhang, XWyvratt, MJZhang, BBZhu, LThornberry, NAWeber, AE Discovery of potent and selective dipeptidyl peptidase IV inhibitors derived from beta-aminoamides bearing subsituted triazolopiperazines. J Med Chem 51:589-602 (2008)  
Target
Name:
Dipeptidyl peptidase 8
Synonyms:
DPP8 DPRP-1 Dipeptidyl peptidase 8 (DPP-8) Dipeptidyl peptidase 8/9 Dipeptidyl peptidase VIII Prolyl dipeptidase DPP8
Type:
Enzyme
Mol. Mass.:
103342.62
Organism:
Homo sapiens (Human)
Description:
Q6V1X1
Residue:
898
  
Inhibitor
Name:
BDBM50232511
Synonyms:
(2R)-4-[8-ethyl-3-(trifluoromethyl)-5,6-dihydro[1,2,4]triazolo[4,3-a]pyrazin-7(8H)-yl]-4-oxo-1-(2,4,5-trifluorophenyl)butan-2-amine hydrochloride | CHEMBL556606
Type:
Small organic molecule
Emp. Form.:
C18H19F6N5O
Mol. Mass.:
435.3668
SMILES:
CCC1N(CCn2c1nnc2C(F)(F)F)C(=O)C[C@H](N)Cc1cc(F)c(F)cc1F
: