Target
Coagulation factor X
Ligand
BDBM50375053
Substrate
Meas. Tech.
ChEMBL_470222 (CHEMBL923682)
IC50
12±n/a nM
Citation
 Imaeda, YKawamoto, TTobisu, MKonishi, NHiroe, KKawamura, MTanaka, TKubo, K Discovery of piperazinylimidazo[1,2-a]pyridines as novel S4 binding elements for orally active factor Xa inhibitors. Bioorg Med Chem 16:3125-40 (2008)  
Target
Name:
Coagulation factor X
Synonyms:
Activated coagulation factor X (FXa) Coagulation factor X precursor F10 Factor X heavy chain Factor Xa Stuart-Prower factor
Type:
Enzyme
Mol. Mass.:
54726.60
Organism:
Homo sapiens (Human)
Description:
Residue:
488
  
Inhibitor
Name:
BDBM50375053
Synonyms:
CHEMBL405361
Type:
Small organic molecule
Emp. Form.:
C25H25ClN4O3S
Mol. Mass.:
497.009
SMILES:
Cc1cn2c(cccc2n1)N1CCN(CC1)C(=O)CCS(=O)(=O)c1ccc2cc(Cl)ccc2c1
: