Target
Cannabinoid receptor 1
Ligand
BDBM50260717
Substrate
Meas. Tech.
ChEMBL_556337 (CHEMBL954070)
Ki
1.75±n/a nM
Citation
 Wustrow, DJMaynard, GDYuan, JZhao, HMao, JGuo, QKershaw, MHammer, JBrodbeck, RMNear, KEZhou, DBeers, DSChenard, BLKrause, JEHutchison, AJ Aminopyrazine CB1 receptor inverse agonists. Bioorg Med Chem Lett 18:3376-81 (2008)  
Target
Name:
Cannabinoid receptor 1
Synonyms:
CANN6 CB-R CNR CNR1_HUMAN Cannabinoid receptor Cannabinoid receptor 1 (brain)
Type:
G Protein-Coupled Receptor (GPCR)
Mol. Mass.:
52868.96
Organism:
Homo sapiens (Human)
Description:
P21554
Residue:
472
  
Inhibitor
Name:
BDBM50260717
Synonyms:
1-(6-(2,4-dichlorophenyl)-5-(4-fluorophenyl)pyrazin-2-yl)-4-(ethylamino)piperidine-4-carboxamide | CHEMBL496919
Type:
Small organic molecule
Emp. Form.:
C24H24Cl2FN5O
Mol. Mass.:
488.385
SMILES:
CCNC1(CCN(CC1)c1cnc(-c2ccc(F)cc2)c(n1)-c1ccc(Cl)cc1Cl)C(N)=O
: